{"text_format":"2","workbook":"xlsx","n_sheets":5,"sheets":["공무원 근무지내 출장(왕복12K미만) 여비 산출","공무원 여비규정 체재비- 국내 여비(23.03.02)","공무원 여비규정 체재비 -국외 여비(21.05.25)","공무원 여비기준 국내여비 산출 기준표","공무원 국외여비 산출 기준표"],"not_rendered":{"charts":0,"images":2,"macros":0,"external_links":0,"defined_names":38,"comments":0,"pivot_tables":0},"unopened":[],"bounds":{"document_bytes":16777216,"sheet_cells":100000,"run_cost":"one","rows_first":2000,"rows_last":500,"rows_between":2000,"halvings":0,"cell_chars":16384,"cell_head_chars":4096},"cells_cut":0,"cells_raw":0,"read":"whole","date_system":"1900"}

{"sheet":"공무원 근무지내 출장(왕복12K미만) 여비 산출","index":0,"n_rows":7,"n_cols":2,"rows_kept":7,"cut":false,"hidden":false,"merged":[]}
["근무지내 국내출장"]
["다음 1 또는 2에 해당하는 출장인 경우"]
["1. 출장이나 여행거리가 왕복 12km 미만인 출장"]
["2. 동일한 시･군 및 섬 안에서의 출장인 경우"]
["소요시간","정액"]
["4시간이상","2만원"]
["4시간미만","1만원"]

{"sheet":"공무원 여비규정 체재비- 국내 여비(23.03.02)","index":1,"n_rows":17,"n_cols":13,"rows_kept":17,"cut":false,"hidden":false,"merged":[[1,4,1,7],[3,5,3,6]]}
[]
["국내 출장 정보 입력",null,null,null,"국내 체재비 산출 금액"]
[{"$nulls":7},"(단위:원)"]
["1. 출장자 신분","조교수이하",null,null,"일비","숙박비",null,"식비"]
["2. 출장지역(조교수이하 필수선택)","서울특별시",null,null,{"$f":"IF(B9>62,(B9-62)*17500+1362500,IF(AND(B9<=62,B9>32),(B9-32)*20000+762500,IF(AND(B9<=32,B9>17),(B9-17)*22500+425000,B9*25000)))","v":2412500},{"$f":"IF(B4=\"교수\",\"실비\",IF(B4=\"부교수\",\"실비\", \"실비, MAX\"))","v":"실비, MAX"},{"$f":"IF(OR(B4=\"교수\",B4=\"부교수\"),\"-\",IF(AND(B4=\"조교수이하\",B5=\"서울특별시\"),100000*B8,IF(AND(B4=\"조교수이하\",B5=\"광역시\"),80000*B8,70000*B8)))","v":12100000},{"$f":"TRUNC(VLOOKUP($B$4,'공무원 여비기준 국내여비 산출 기준표'!$A$1:$D$4,4)*$B$9-I5)","v":3041666},{"$f":"(VLOOKUP($B$4,'공무원 여비기준 국내여비 산출 기준표'!A1:D4,4,0)/3)*($B$11)","v":8333.3333333333339},null,"교수","부교수","조교수이하"]
["3. 출장시작일","2024-04-01",null,null,null,"* 실비로 숙박비 증빙 필수이며,  친지 집 등에 숙박하거나 2인 이상이 공동으로 숙박한 경우 감액됨.",{"$nulls":4},"실비","실비","서울특별시"]
["4. 출장종료일","2024-07-31",{"$nulls":10},"광역시"]
["  - 숙박일수",{"$f":"DATEDIF(B6,B7,\"d\")","v":121},{"$nulls":10},"그밖의지역"]
["  - 체재일수",{"$f":"DATEDIF(B6,B7,\"d\")+1","v":122}]
["5. 출장기관 제공 숙박 일수",1]
["6. 출장기관 제공 식사 총 횟수",1]
[]
["1. 출장자의 신분을 선택하세요."]
["2. 조교수이하인 경우 출장지역 구분을 선택하세요."]
["3~4. 시작일과 출장종료일을 입력하세요."]
["5. 출장기관에서 제공하는 숙박일수를 입력하세요."]
["6. 출장기관에서 제공받는 식사횟수를 입력하세요."]

{"sheet":"공무원 여비규정 체재비 -국외 여비(21.05.25)","index":2,"n_rows":163,"n_cols":23,"rows_kept":163,"cut":false,"hidden":false,"merged":[[3,15,3,21],[1,5,1,8],[2,1,2,2],[2,5,2,8],[4,8,5,8],[1,1,1,2],[3,6,3,7],[4,5,5,5]]}
[]
[null,"국외 출장 정보 입력",null,null,null,"국외 체재비 산출 금액"]
[{"$nulls":5},"(단위:원)"]
[null,"1. 출장자 신분","조교수이하",null,null,"일비","숙박비",null,"식비",{"$nulls":6},"대도시 있는 국가",{"$nulls":6},"대도시없는국가"]
[null,"2-①차분류 : 출장국가","미국",null,null,{"$f":"ROUNDDOWN(IF(AND(C4=\"교수\",C10>62),(C10-62)*24.5+1907.5,IF(AND(C4=\"교수\",C10<=62,C10>32),(C10-32)*28+1067.5,IF(AND(C4=\"교수\",C10<=32,C10>17),(C10-17)*31.5+595,IF(AND(C4=\"교수\",C10<=17),C10*35,IF(AND(C4=\"부교수\",C10>62),(C10-62)*24.5+1907.5,IF(AND(C4=\"부교수\",C10<=62,C10>32),(C10-32)*28+1067.5,IF(AND(C4=\"부교수\",C10<=32,C10>17),(C10-17)*31.5+595,IF(AND(C4=\"부교수\",C10<=17),C10*35,IF(AND(C4=\"조교수이하\",C10>62),(C10-62)*21+1635,IF(AND(C4=\"조교수이하\",C10<=62,C10>32),(C10-32)*24+915,IF(AND(C4=\"조교수이하\",C10<=32,C10>17),(C10-17)*27+510,C10*30)))))))))))*ROUNDDOWN(C13,0),-1)","v":1385740}," 실비, MAX",{"$f":"ROUNDDOWN((VLOOKUP(K9,'공무원 국외여비 산출 기준표'!J:M,3,0)*($C$9-$C$11))*ROUNDDOWN(C13,0),-1)","v":8154430},{"$f":"ROUNDDOWN((VLOOKUP(K9,'공무원 국외여비 산출 기준표'!J:M,4,0)*($C$10)-$J$5)*ROUNDDOWN(C13,0),-1)","v":3904520},{"$f":"(VLOOKUP(K9,'공무원 국외여비 산출 기준표'!J:M,4,0)/3)*($C$12)","v":54},{"$nulls":5},"중국","미국","러시아","프랑스","스위스","영국","일본","국가명"]
[null,"2-②차분류 : 출장국가 또는 도시","뉴욕",{"$f":"\"'\"&K8&\"'등급지역\"","v":"'가'등급지역"},null,null,"또는 할인정액",{"$f":"ROUNDDOWN(H5*0.85,-1)","v":6931260},{"$nulls":7},"베이징","뉴욕","모스크바","파리","제네바","런던","동경","가나"]
[null,"3. 출장시작일","2024-07-01",null,null,null,"* 실비는 숙박비 증빙 제출 필수",null,null," - 출장국가 및 도시",{"$f":"C5&\"/\"&C6","v":"미국/뉴욕"},{"$nulls":4},"홍콩","로스엔젤레스","러시아","프랑스","스위스","영국","일본","가봉"]
[null,"4. 출장종료일","2024-08-04",{"$nulls":6}," - 지역등급",{"$f":"VLOOKUP(K7,'공무원 국외여비 산출 기준표'!C:D,2,0)","v":"가"},{"$nulls":4},"중국","샌프란시스코",{"$nulls":5},"가이아나"]
[null,"   - 숙박일수",{"$f":"DATEDIF(C7,C8,\"d\")","v":34},{"$nulls":6}," - 신분 및 출장지 등급",{"$f":"C4&\"/\"&K8","v":"조교수이하/가"},{"$nulls":5},"워싱턴D.C.",{"$nulls":5},"감비아"]
[null,"   - 체재일수",{"$f":"DATEDIF(C7,C8,\"d\")+1","v":35},{"$nulls":13},"미국",{"$nulls":5},"과테말라"]
[null,"5. 출장기관 제공 숙박 또는 기내 숙박 일수",1,{"$nulls":19},"그리스"]
[null,"6. 출장기관 제공 식사 또는 기내 식사 총 횟수",2,{"$nulls":19},"기니"]
[null,"7. 제출환율표의 환율($)",1404.5245600000001,{"$nulls":19},"기니비사우"]
[{"$nulls":22},"나미비아"]
[null,"1. 출장자의 신분을 선택하세요.",{"$nulls":20},"나이지리아"]
[null,"2-① 출장지에 대도시가 있는 경우 도시가 있는 '국가명(미국, 중국, 프랑스 등)'을 선택하세요. 대도시가 없는 경우 '국가명'을 선택하세요. ",{"$nulls":20},"남수단"]
[null,"2-② 출장국가 또는 대도시명을 선택하세요.",{"$nulls":20},"남아프리카공화국"]
[null,"3.~4.  출장시작일과 출장종료일을 입력하세요.(국내 출발, 도착 기준)",{"$nulls":20},"네덜란드"]
[null,"5. 기내에서 숙박하는 일수, 출장기관에서 제공하는 숙박 총일수를 입력하세요.",{"$nulls":20},"네팔"]
[null,"6. 기내에서 제공되는 식사, 출장기관에서 제공받는 식사 총횟수를 입력하세요.",{"$nulls":20},"노르웨이"]
[null,"7. 제출하는 환율표의 적용환율을 입력하세요.",{"$nulls":20},"뉴질랜드"]
[{"$nulls":22},"니우에"]
[{"$nulls":22},"니제르"]
[{"$nulls":22},"니카라과"]
[{"$nulls":22},"덴마크"]
[{"$nulls":22},"도미니카공화국"]
[{"$nulls":22},"독일"]
[{"$nulls":22},"동티모르"]
[{"$nulls":22},"라오스"]
[{"$nulls":22},"라이베리아"]
[{"$nulls":22},"라트비아"]
[{"$nulls":22},"레바논"]
[{"$nulls":22},"레소토"]
[{"$nulls":22},"루마니아"]
[{"$nulls":22},"룩셈부르크"]
[{"$nulls":22},"르완다"]
[{"$nulls":22},"리비아"]
[{"$nulls":22},"리투아니아"]
[{"$nulls":22},"마다가스카르"]
[{"$nulls":22},"마셜군도"]
[{"$nulls":22},"마케도니아"]
[{"$nulls":22},"말라위"]
[{"$nulls":22},"말레이시아"]
[{"$nulls":22},"말리"]
[{"$nulls":22},"멕시코"]
[{"$nulls":22},"모로코"]
[{"$nulls":22},"모리셔스"]
[{"$nulls":22},"모리타니"]
[{"$nulls":22},"모잠비크"]
[{"$nulls":22},"몬테네그로"]
[{"$nulls":22},"몰도바"]
[{"$nulls":22},"몽골"]
[{"$nulls":22},"미얀마"]
[{"$nulls":22},"미크로네시아"]
[{"$nulls":22},"바레인"]
[{"$nulls":22},"바베이도스"]
[{"$nulls":22},"방글라데시"]
[{"$nulls":22},"베네수엘라"]
[{"$nulls":22},"베트남"]
[{"$nulls":22},"벨기에"]
[{"$nulls":22},"벨라루스"]
[{"$nulls":22},"벨리즈"]
[{"$nulls":22},"보스니아헤르체코비나"]
[{"$nulls":22},"보츠와나"]
[{"$nulls":22},"볼리비아"]
[{"$nulls":22},"부르키나파소"]
[{"$nulls":22},"불가리아"]
[{"$nulls":22},"브라질"]
[{"$nulls":22},"브루나이"]
[{"$nulls":22},"사모아"]
[{"$nulls":22},"사우디아라비아"]
[{"$nulls":22},"사이프러스"]
[{"$nulls":22},"상투메프린시페"]
[{"$nulls":22},"세네갈"]
[{"$nulls":22},"세르비아"]
[{"$nulls":22},"세이셸"]
[{"$nulls":22},"세인트루시아"]
[{"$nulls":22},"세인트빈센트그레나딘"]
[{"$nulls":22},"세인트키츠네비스"]
[{"$nulls":22},"소말리아"]
[{"$nulls":22},"수단"]
[{"$nulls":22},"수리남"]
[{"$nulls":22},"스리랑카"]
[{"$nulls":22},"스와질란드"]
[{"$nulls":22},"스웨덴"]
[{"$nulls":22},"스페인"]
[{"$nulls":22},"슬로바키아"]
[{"$nulls":22},"슬로베니아"]
[{"$nulls":22},"시에라리온"]
[{"$nulls":22},"싱가포르"]
[{"$nulls":22},"아랍에미리트"]
[{"$nulls":22},"아르헨티나"]
[{"$nulls":22},"아이슬란드"]
[{"$nulls":22},"아이티"]
[{"$nulls":22},"아일랜드"]
[{"$nulls":22},"아제르바이잔"]
[{"$nulls":22},"아프가니스탄"]
[{"$nulls":22},"알바니아"]
[{"$nulls":22},"알제리"]
[{"$nulls":22},"앙골라"]
[{"$nulls":22},"앤티가바부다"]
[{"$nulls":22},"에스토니아"]
[{"$nulls":22},"에콰도르"]
[{"$nulls":22},"에티오피아"]
[{"$nulls":22},"엘살바도르"]
[{"$nulls":22},"예멘"]
[{"$nulls":22},"오만"]
[{"$nulls":22},"오스트레일리아"]
[{"$nulls":22},"오스트리아"]
[{"$nulls":22},"온두라스"]
[{"$nulls":22},"요르단"]
[{"$nulls":22},"우간다"]
[{"$nulls":22},"우루과이"]
[{"$nulls":22},"우즈베키스탄"]
[{"$nulls":22},"우크라이나"]
[{"$nulls":22},"이라크"]
[{"$nulls":22},"이란"]
[{"$nulls":22},"이스라엘"]
[{"$nulls":22},"이집트"]
[{"$nulls":22},"이탈리아"]
[{"$nulls":22},"인도"]
[{"$nulls":22},"인도네시아"]
[{"$nulls":22},"자메이카"]
[{"$nulls":22},"잠비아"]
[{"$nulls":22},"적도기니"]
[{"$nulls":22},"중앙아프리카공화국"]
[{"$nulls":22},"짐바브웨"]
[{"$nulls":22},"체코"]
[{"$nulls":22},"칠레"]
[{"$nulls":22},"카메룬"]
[{"$nulls":22},"카자흐스탄"]
[{"$nulls":22},"카타르"]
[{"$nulls":22},"캄보디아"]
[{"$nulls":22},"캐나다"]
[{"$nulls":22},"케냐"]
[{"$nulls":22},"코스타리카"]
[{"$nulls":22},"코트디부아르"]
[{"$nulls":22},"콜롬비아"]
[{"$nulls":22},"콩고민주공화국"]
[{"$nulls":22},"쿠웨이트"]
[{"$nulls":22},"쿡제도"]
[{"$nulls":22},"크로아티아"]
[{"$nulls":22},"키르키즈공화국"]
[{"$nulls":22},"타이"]
[{"$nulls":22},"타이완"]
[{"$nulls":22},"타지키스탄"]
[{"$nulls":22},"탄자니아"]
[{"$nulls":22},"터키"]
[{"$nulls":22},"통가"]
[{"$nulls":22},"투르크메니스탄"]
[{"$nulls":22},"튀니지"]
[{"$nulls":22},"트리니다드토바고"]
[{"$nulls":22},"파나마"]
[{"$nulls":22},"파라과이"]
[{"$nulls":22},"파키스탄"]
[{"$nulls":22},"파푸아뉴기니"]
[{"$nulls":22},"페루"]
[{"$nulls":22},"포르투갈"]
[{"$nulls":22},"폴란드"]
[{"$nulls":22},"피지"]
[{"$nulls":22},"핀란드"]
[{"$nulls":22},"필리핀"]
[{"$nulls":22},"헝가리"]

{"sheet":"공무원 여비기준 국내여비 산출 기준표","index":3,"n_rows":4,"n_cols":4,"rows_kept":4,"cut":false,"hidden":false,"merged":[]}
["구분","일비","숙박비","식비"]
["교수",25000,"실비",25000]
["부교수",25000,"실비",25000]
["조교수이하",25000,"실비",25000]

{"sheet":"공무원 국외여비 산출 기준표","index":4,"n_rows":177,"n_cols":24,"rows_kept":177,"cut":false,"hidden":false,"merged":[]}
["국가","도시",{"$f":"A1&B1","v":"국가도시"},"등급",null,null,null,"구분","등급",{"$f":"H1&\"/\"&I1","v":"구분/등급"},"일비","숙박비","식비",null,null,"교수",null,null,null,"구분","등급","일비","숙박비","식비"]
["중국","베이징",{"$f":"A2&\"/\"&B2","v":"중국/베이징"},"나",{"$f":"A2=B2","v":false},null,null,"교수","가",{"$f":"H2&\"/\"&I2","v":"교수/가"},35,223,107,null,null,"부교수",null,null,null,"교수","가",35,223,107]
["일본","도쿄",{"$f":"A3&\"/\"&B3","v":"일본/도쿄"},"가",{"$f":"A3=B3","v":false},null,null,"교수","나",{"$f":"H3&\"/\"&I3","v":"교수/나"},35,160,78,null,null,"조교수이하",{"$nulls":4},"나",35,160,78]
["미국","뉴욕","미국/뉴욕","가",false,null,null,"교수","다","교수/다",35,130,58,{"$nulls":7},"다",35,130,58]
["영국","런던","영국/런던","가",false,null,null,"교수","라","교수/라",35,85,49,{"$nulls":7},"라",35,85,49]
["미국","로스엔젤레스","미국/로스엔젤레스","가",false,null,null,"부교수","가","부교수/가",35,223,107,{"$nulls":6},"부교수","가",35,223,107]
["러시아","모스크바","러시아/모스크바","가",false,null,null,"부교수","나","부교수/나",35,160,78,{"$nulls":7},"나",35,160,78]
["미국","샌프란시스코","미국/샌프란시스코","가",false,null,null,"부교수","다","부교수/다",35,130,58,{"$nulls":7},"다",35,130,58]
["미국","워싱턴D.C.","미국/워싱턴D.C.","가",false,null,null,"부교수","라","부교수/라",35,85,49,{"$nulls":7},"라",35,85,49]
["프랑스","파리","프랑스/파리","가",false,null,null,"조교수이하","가","조교수이하/가",30,176,81,{"$nulls":6},"조교수이하","가",30,176,81]
["중국","홍콩","중국/홍콩","가",false,null,null,"조교수이하","나","조교수이하/나",30,137,59,{"$nulls":7},"나",30,137,59]
["스위스","제네바","스위스/제네바","가",false,null,null,"조교수이하","다","조교수이하/다",30,106,44,{"$nulls":7},"다",30,106,44]
["네팔","네팔",{"$f":"\"국가명/\"&B13","v":"국가명/네팔"},"라",true,null,null,"조교수이하","라","조교수이하/라",30,81,37,{"$nulls":7},"라",30,81,37]
["동티모르","동티모르",{"$f":"\"국가명/\"&B14","v":"국가명/동티모르"},"라",true]
["라오스","라오스","국가명/라오스","라",true,{"$nulls":14},"2. 국가 및 도시별 등급 구분은 다음과 같다."]
["몽골","몽골","국가명/몽골","라",true,{"$nulls":14},"가. 가등급: 도쿄, 뉴욕, 런던, 로스엔젤레스, 모스크바, 샌프란시스코, 워싱턴 D.C., 파리, 홍콩, 제네바, 싱가포르"]
["미얀마","미얀마","국가명/미얀마","라",true,{"$nulls":14},"나. 나등급"]
["미크로네시아","미크로네시아","국가명/미크로네시아","라",true,{"$nulls":14},"1) 아시아주ㆍ오세아니아주: 베이징, 사모아, 오스트레일리아, 인도, 일본, 카자흐스탄, 쿡제도, 타이완, 파푸아뉴기니"]
["베트남","베트남","국가명/베트남","라",true,{"$nulls":14},"2) 남ㆍ북아메리카주: 멕시코, 미국, 바베이도스, 세인트루시아, 세인트빈센트그레나딘, 세인트키츠네비스, 아이티, 앤티가바부다, 자메이카, 캐나다, 트리니다드토바고"]
["스리랑카","스리랑카","국가명/스리랑카","라",true,{"$nulls":14},"3) 유럽주: 그리스, 네덜란드, 노르웨이, 덴마크, 독일, 러시아, 룩셈부르크, 벨기에, 사이프러스, 스웨덴, 스위스, 스페인, 아이슬란드, 아일랜드, 영국, 오스트리아, 이탈리아, 포르투갈, 프랑스, 핀란드, 헝가리"]
["우즈베키스탄","우즈베키스탄","국가명/우즈베키스탄","라",true,{"$nulls":14},"4) 중동ㆍ아프리카주: 가나, 가봉, 남수단, 남아프리카공화국, 리비아, 모로코, 바레인, 사우디아라비아, 세이셸, 아랍에미리트, 앙골라, 에티오피아, 오만, 우간다, 이스라엘, 이집트, 적도기니, 카타르, 코트디부아르, 콩고민주공화국, 쿠웨이트 "]
["캄보디아","캄보디아","국가명/캄보디아","라",true,{"$nulls":14},"다. 다등급"]
["타지키스탄","타지키스탄","국가명/타지키스탄","라",true,{"$nulls":14},"1) 아시아주ㆍ오세아니아주: 뉴질랜드, 니우에, 마셜군도, 말레이시아, 방글라데시, 브루나이, 아제르바이잔, 인도네시아, 중국, 키르키즈공화국, 타이, 터키, 투르크메니스탄, 파키스탄, 피지"]
["통가","통가","국가명/통가","라",true,{"$nulls":14},"2) 남ㆍ북아메리카주: 가이아나, 과테말라, 도미니카공화국, 베네수엘라, 벨리즈, 브라질, 아르헨티나, 에콰도르, 우루과이, 칠레, 코스타리카, 파나마"]
["필리핀","필리핀","국가명/필리핀","라",true,{"$nulls":14},"3) 유럽주: 라트비아, 루마니아, 리투아니아, 몬테네그로, 불가리아, 세르비아, 슬로바키아, 슬로베니아, 에스토니아, 우크라이나, 체코, 크로아티아, 폴란드"]
["니카라과","니카라과","국가명/니카라과","라",true,{"$nulls":14},"4) 중동ㆍ아프리카주: 기니, 나이지리아, 니제르, 라이베리아, 레바논, 르완다, 말리, 모리셔스, 모잠비크, 보츠와나, 부르키나파소, 상투메프린시페, 세네갈, 수단, 스와질란드, 시에라리온, 아프가니스탄, 알제리, 요르단, 이라크, 잠비아, 중앙아프리카공화국, 카메룬, 케냐, 탄자니아 "]
["볼리비아","볼리비아","국가명/볼리비아","라",true,{"$nulls":14},"라. 라등급"]
["수리남","수리남","국가명/수리남","라",true,{"$nulls":14},"1) 아시아주ㆍ오세아니아주: 네팔, 동티모르, 라오스, 몽골, 미얀마, 미크로네시아, 베트남, 스리랑카, 우즈베키스탄, 캄보디아, 타지키스탄, 통가, 필리핀"]
["엘살바도르","엘살바도르","국가명/엘살바도르","라",true,{"$nulls":14},"2) 남ㆍ북아메리카주: 니카라과, 볼리비아, 수리남, 엘살바도르, 온두라스, 콜롬비아, 파라과이, 페루"]
["온두라스","온두라스","국가명/온두라스","라",true,{"$nulls":14},"3) 유럽주: 마케도니아, 몰도바, 벨라루스, 보스니아헤르체코비나, 알바니아"]
["콜롬비아","콜롬비아","국가명/콜롬비아","라",true,{"$nulls":14},"4) 중동ㆍ아프리카주: 감비아, 기니비사우, 나미비아, 레소토, 마다가스카르, 말라위, 모리타니, 소말리아, 예멘, 이란, 짐바브웨, 튀니지"]
["파라과이","파라과이","국가명/파라과이","라",true,{"$nulls":14},"3. 제2호의 국가 및 도시별 등급 구분에 없는 국가는 여행 또는 근무 예정지에서 제2호의 국가의 수도까지의 거리가 가장 가까운 국가의 등급을 적용한다."]
["페루","페루","국가명/페루","라",true,{"$nulls":14},"4. 숙박비는 실비 상한액에도 불구하고 인사혁신처장이 정하는 기준에 따라 실비 상한액보다 낮은 금액을 정액(이하 \"할인정액\"이라 한다)으로 지급할 수 있으며, 할인정액으로 지급한 경우에는 제8조의2를 적용하지 않는다."]
["마케도니아","마케도니아","국가명/마케도니아","라",true]
["몰도바","몰도바","국가명/몰도바","라",true]
["벨라루스","벨라루스","국가명/벨라루스","라",true]
["보스니아헤르체코비나","보스니아헤르체코비나","국가명/보스니아헤르체코비나","라",true]
["알바니아","알바니아","국가명/알바니아","라",true]
["감비아","감비아","국가명/감비아","라",true]
["기니비사우","기니비사우","국가명/기니비사우","라",true]
["나미비아","나미비아","국가명/나미비아","라",true]
["레소토","레소토","국가명/레소토","라",true]
["마다가스카르","마다가스카르","국가명/마다가스카르","라",true]
["말라위","말라위","국가명/말라위","라",true]
["모리타니","모리타니","국가명/모리타니","라",true]
["소말리아","소말리아","국가명/소말리아","라",true]
["예멘","예멘","국가명/예멘","라",true]
["이란","이란","국가명/이란","라",true]
["짐바브웨","짐바브웨","국가명/짐바브웨","라",true]
["튀니지","튀니지","국가명/튀니지","라",true]
["기니","기니","국가명/기니","다",true]
["나이지리아","나이지리아","국가명/나이지리아","다",true]
["니제르","니제르","국가명/니제르","다",true]
["라이베리아","라이베리아","국가명/라이베리아","다",true]
["레바논","레바논","국가명/레바논","다",true]
["르완다","르완다","국가명/르완다","다",true]
["말리","말리","국가명/말리","다",true]
["모리셔스","모리셔스","국가명/모리셔스","다",true]
["모잠비크","모잠비크","국가명/모잠비크","다",true]
["보츠와나","보츠와나","국가명/보츠와나","다",true]
["부르키나파소","부르키나파소","국가명/부르키나파소","다",true]
["상투메프린시페","상투메프린시페","국가명/상투메프린시페","다",true]
["세네갈","세네갈","국가명/세네갈","다",true]
["수단","수단","국가명/수단","다",true]
["스와질란드","스와질란드","국가명/스와질란드","다",true]
["시에라리온","시에라리온","국가명/시에라리온","다",true]
["아프가니스탄","아프가니스탄","국가명/아프가니스탄","다",{"$f":"A67=B67","v":true}]
["알제리","알제리","국가명/알제리","다",true]
["요르단","요르단","국가명/요르단","다",true]
["이라크","이라크","국가명/이라크","다",true]
["잠비아","잠비아","국가명/잠비아","다",true]
["중앙아프리카공화국","중앙아프리카공화국","국가명/중앙아프리카공화국","다",true]
["카메룬","카메룬","국가명/카메룬","다",true]
["케냐","케냐","국가명/케냐","다",true]
["탄자니아","탄자니아","국가명/탄자니아","다",true]
["라트비아","라트비아","국가명/라트비아","다",true]
["루마니아","루마니아","국가명/루마니아","다",true]
["리투아니아","리투아니아",{"$f":"\"국가명/\"&B78","v":"국가명/리투아니아"},"다",true]
["몬테네그로","몬테네그로","국가명/몬테네그로","다",true]
["불가리아","불가리아","국가명/불가리아","다",true]
["세르비아","세르비아","국가명/세르비아","다",true]
["슬로바키아","슬로바키아","국가명/슬로바키아","다",true]
["슬로베니아","슬로베니아","국가명/슬로베니아","다",true]
["에스토니아","에스토니아","국가명/에스토니아","다",true]
["우크라이나","우크라이나","국가명/우크라이나","다",true]
["체코","체코","국가명/체코","다",true]
["크로아티아","크로아티아","국가명/크로아티아","다",true]
["폴란드","폴란드","국가명/폴란드","다",true]
["가이아나","가이아나","국가명/가이아나","다",true]
["과테말라","과테말라","국가명/과테말라","다",true]
["도미니카공화국","도미니카공화국","국가명/도미니카공화국","다",true]
["베네수엘라","베네수엘라","국가명/베네수엘라","다",true]
["벨리즈","벨리즈","국가명/벨리즈","다",true]
["브라질","브라질","국가명/브라질","다",true]
["아르헨티나","아르헨티나","국가명/아르헨티나","다",true]
["에콰도르","에콰도르","국가명/에콰도르","다",true]
["우루과이","우루과이","국가명/우루과이","다",true]
["칠레","칠레","국가명/칠레","다",true]
["코스타리카","코스타리카","국가명/코스타리카","다",true]
["파나마","파나마","국가명/파나마","다",true]
["뉴질랜드","뉴질랜드","국가명/뉴질랜드","다",true]
["니우에","니우에","국가명/니우에","다",true]
["마셜군도","마셜군도","국가명/마셜군도","다",true]
["말레이시아","말레이시아","국가명/말레이시아","다",true]
["방글라데시","방글라데시","국가명/방글라데시","다",true]
["브루나이","브루나이","국가명/브루나이","다",true]
["아제르바이잔","아제르바이잔","국가명/아제르바이잔","다",true]
["인도네시아","인도네시아","국가명/인도네시아","다",true]
["중국","중국",{"$f":"A109&\"/\"&B109","v":"중국/중국"},"다",true]
["키르키즈공화국","키르키즈공화국","국가명/키르키즈공화국","다",true]
["타이","타이","국가명/타이","다",true]
["터키","터키","국가명/터키","다",true]
["투르크메니스탄","투르크메니스탄","국가명/투르크메니스탄","다",true]
["파키스탄","파키스탄","국가명/파키스탄","다",true]
["피지","피지","국가명/피지","다",true]
["가나","가나","국가명/가나","나",true]
["가봉","가봉","국가명/가봉","나",true]
["남수단","남수단","국가명/남수단","나",true]
["남아프리카공화국","남아프리카공화국","국가명/남아프리카공화국","나",true]
["리비아","리비아","국가명/리비아","나",true]
["모로코","모로코","국가명/모로코","나",true]
["바레인","바레인","국가명/바레인","나",true]
["사우디아라비아","사우디아라비아","국가명/사우디아라비아","나",true]
["세이셸","세이셸","국가명/세이셸","나",true]
["아랍에미리트","아랍에미리트","국가명/아랍에미리트","나",true]
["앙골라","앙골라","국가명/앙골라","나",true]
["에티오피아","에티오피아","국가명/에티오피아","나",true]
["오만","오만","국가명/오만","나",true]
["우간다","우간다","국가명/우간다","나",true]
["이스라엘","이스라엘","국가명/이스라엘","나",true]
["이집트","이집트","국가명/이집트","나",{"$f":"A131=B131","v":true}]
["적도기니","적도기니","국가명/적도기니","나",true]
["카타르","카타르","국가명/카타르","나",true]
["코트디부아르","코트디부아르","국가명/코트디부아르","나",true]
["콩고민주공화국","콩고민주공화국","국가명/콩고민주공화국","나",true]
["쿠웨이트","쿠웨이트","국가명/쿠웨이트","나",true]
["그리스","그리스","국가명/그리스","나",true]
["네덜란드","네덜란드","국가명/네덜란드","나",true]
["노르웨이","노르웨이","국가명/노르웨이","나",true]
["덴마크","덴마크","국가명/덴마크","나",true]
["독일","독일","국가명/독일","나",true]
["러시아","러시아",{"$f":"A142&\"/\"&B142","v":"러시아/러시아"},"나",true]
["룩셈부르크","룩셈부르크",{"$f":"\"국가명/\"&B143","v":"국가명/룩셈부르크"},"나",true]
["벨기에","벨기에","국가명/벨기에","나",true]
["사이프러스","사이프러스","국가명/사이프러스","나",true]
["스웨덴","스웨덴","국가명/스웨덴","나",true]
["스위스","스위스",{"$f":"A147&\"/\"&B147","v":"스위스/스위스"},"나",true]
["스페인","스페인","국가명/스페인","나",true]
["아이슬란드","아이슬란드","국가명/아이슬란드","나",true]
["아일랜드","아일랜드","국가명/아일랜드","나",true]
["영국","영국",{"$f":"A151&\"/\"&B151","v":"영국/영국"},"나",true]
["오스트리아","오스트리아","국가명/오스트리아","나",true]
["이탈리아","이탈리아","국가명/이탈리아","나",true]
["포르투갈","포르투갈","국가명/포르투갈","나",true]
["프랑스","프랑스",{"$f":"A155&\"/\"&B155","v":"프랑스/프랑스"},"나",true]
["핀란드","핀란드","국가명/핀란드","나",true]
["헝가리","헝가리","국가명/헝가리","나",true]
["멕시코","멕시코","국가명/멕시코","나",true]
["미국","미국",{"$f":"A159&\"/\"&B159","v":"미국/미국"},"나",true]
["바베이도스","바베이도스","국가명/바베이도스","나",true]
["세인트루시아","세인트루시아","국가명/세인트루시아","나",true]
["세인트빈센트그레나딘","세인트빈센트그레나딘","국가명/세인트빈센트그레나딘","나",true]
["세인트키츠네비스","세인트키츠네비스","국가명/세인트키츠네비스","나",true]
["아이티","아이티","국가명/아이티","나",true]
["앤티가바부다","앤티가바부다","국가명/앤티가바부다","나",true]
["자메이카","자메이카","국가명/자메이카","나",true]
["캐나다","캐나다","국가명/캐나다","나",true]
["트리니다드토바고","트리니다드토바고","국가명/트리니다드토바고","나",true]
["사모아","사모아","국가명/사모아","나",true]
["오스트레일리아","오스트레일리아","국가명/오스트레일리아","나",true]
["인도","인도","국가명/인도","나",true]
["일본","일본",{"$f":"A172&\"/\"&B172","v":"일본/일본"},"나",true]
["카자흐스탄","카자흐스탄","국가명/카자흐스탄","나",true]
["쿡제도","쿡제도","국가명/쿡제도","나",true]
["타이완","타이완","국가명/타이완","나",true]
["파푸아뉴기니","파푸아뉴기니","국가명/파푸아뉴기니","나",true]
["싱가포르","싱가포르","국가명/싱가포르","가",true]