{"text_format":"2","workbook":"xlsx","n_sheets":4,"sheets":["국내 여비산출","국외 여비산출","국내여비 산출 기준표","국외여비 산출 기준표"],"not_rendered":{"charts":0,"images":5,"macros":0,"external_links":0,"defined_names":13,"comments":0,"pivot_tables":0},"unopened":[],"bounds":{"document_bytes":16777216,"sheet_cells":100000,"run_cost":"one","rows_first":2000,"rows_last":500,"rows_between":2000,"halvings":0,"cell_chars":16384,"cell_head_chars":4096},"cells_cut":0,"cells_raw":0,"read":"whole","date_system":"1900"}

{"sheet":"국내 여비산출","index":0,"n_rows":15,"n_cols":8,"rows_kept":15,"cut":false,"hidden":false,"merged":[[1,0,1,1],[1,4,1,6],[11,0,11,1],[12,0,12,1],[5,5,8,5]]}
[]
["출장 정보 입력",null,null,null,"체재비 산출 금액"]
[{"$nulls":6},"(단위:원)"]
["1. 출장자 신분","교수",null,null,"일비","숙박비","식비"]
["2. 출장시작일","2024-07-01",null,null,{"$f":"VLOOKUP(B4,'국내여비 산출 기준표'!$A$1:$D$9,2,0)*$B$8","v":120000},{"$f":"VLOOKUP(B4,'국내여비 산출 기준표'!$A$1:$D$9,3,0)*($B$7-$B$9)","v":130000},{"$f":"VLOOKUP(B4,'국내여비 산출 기준표'!$A$1:$D$9,4,0)*($B$8)-H5","v":40000},{"$f":"(VLOOKUP(B4,'국내여비 산출 기준표'!$A$1:$D$9,4,0)/3)*($B$10)","v":80000}]
["3. 출장종료일","2024-07-03",null,null,null,"※ 학술회의 개최 장소 및 학술회의 지정 숙박\n→ 실비정산가능, 증빙 필수"]
["  - 숙박일수",{"$f":"DATEDIF(B5,B6,\"d\")","v":2}]
["  - 체재일수",{"$f":"DATEDIF(B5,B6,\"d\")+1","v":3}]
["4. 출장기관 제공 숙박 일수",1]
["5. 출장기관 제공 식사 횟수",6]
[]
["1. 출장자의 신분을 선택하세요."]
["2.~3.  출장시작일과 출장종료일을 입력하세요."]
["4. 출장기관에서 제공하는 숙박일수를 입력하세요."]
["5. 출장기관에서 제공받는 식사횟수를 입력하세요."]

{"sheet":"국외 여비산출","index":1,"n_rows":144,"n_cols":19,"rows_kept":144,"cut":false,"hidden":false,"merged":[[15,1,15,2],[16,1,16,2],[17,1,17,2],[18,1,18,2],[1,1,1,2],[1,5,1,7],[2,12,2,17],[2,5,2,7],[2,1,2,2],[5,6,6,6]]}
[]
[null,"출장 정보 입력",null,null,null,"체재비 산출 금액"]
[{"$nulls":5},"(단위:원)",{"$nulls":6},"대도시 있는국가",{"$nulls":5},"대도시없는국가"]
[null,"1. 출장자 신분","교수",null,null,"일비","숙박비","식비",{"$nulls":4},"중국","미국","러시아","프랑스","영국","일본","국가명"]
[null,"2-①차분류 : 출장국가","중국",null,null,{"$f":"(VLOOKUP(J8,'국외여비 산출 기준표'!J:M,2,0)*C10*C13)","v":336960},{"$f":"(VLOOKUP(J8,'국외여비 산출 기준표'!J:M,3,0)*($C$9-$C$11))*C13","v":387504},{"$f":"(VLOOKUP(J8,'국외여비 산출 기준표'!J:M,4,0)*($C$10)-I5)*C13","v":438984},{"$f":"(VLOOKUP(J8,'국외여비 산출 기준표'!J:M,4,0)/3)*($C$12)","v":89.333333333333329},null,null,null,"광주","뉴욕","러시아","파리","런던","동경","가나"]
[null,"2-②차분류 : 출장국가 또는 도시","북경",null,null,null,"※ 학술회의 개최 장소 및 학술회의 지정 숙박\n→ 실비정산가능. 증빙 필수",null," - 출장국가 및 도시",{"$f":"C5&\"/\"&C6","v":"중국/북경"},null,null,"남경","라스베이거스","모스크바","프랑스","영국","일본","가봉"]
[null,"3. 출장시작일","2024-07-22",{"$nulls":5}," - 지역등급",{"$f":"VLOOKUP(J6,'국외여비 산출 기준표'!C:D,2,0)","v":"특B지"},null,null,"대련","로스앤젤레스",{"$nulls":4},"가이아나"]
[null,"4. 출장종료일","2024-07-24",{"$nulls":5}," - 신분 및 출장지 등급",{"$f":"C4&\"/\"&J7","v":"교수/특B지"},null,null,"마카오","미국",{"$nulls":4},"감비아"]
[null,"   - 숙박일수",{"$f":"DATEDIF(C7,C8,\"d\")","v":2},{"$nulls":9},"북경","보스턴",{"$nulls":4},"과테말라"]
[null,"   - 체재일수",{"$f":"DATEDIF(C7,C8,\"d\")+1","v":3},{"$nulls":9},"상해","샌디에이고",{"$nulls":4},"그리스"]
[null,"5. 출장기관 제공 숙박 또는 기내 숙박 일수",1,{"$nulls":9},"심천","샌프란시스코",{"$nulls":4},"기네비스"]
[null,"6. 출장기관 제공 식사 또는 기내 식사 횟수",2,{"$nulls":9},"중국","워싱턴",{"$nulls":4},"기니"]
[null,"7. 출장신청일자 하나은행 환율($)",1404,{"$nulls":9},"천진","하와이",{"$nulls":4},"나미비아"]
[{"$nulls":12},"홍콩",{"$nulls":5},"나이지리아"]
[{"$nulls":18},"남아프리카공화국"]
[null,"1. 출장자의 신분을 선택하세요.",{"$nulls":16},"네덜란드"]
[null,"2-① 출장지에 대도시가 있는 경우 도시가 있는 '국가명(미국, 중국, 프랑스 등)'을 선택하세요. 대도시가 없는 경우 '국가명'을 선택하세요. ",{"$nulls":16},"네팔"]
[null,"2-② 출장국가 또는 대도시명을 선택하세요.",{"$nulls":16},"노르웨이"]
[null,"3.~4.  출장시작일과 출장종료일을 입력하세요.(국내 출발, 도착 기준)",{"$nulls":16},"뉴질랜드"]
[null,"5. 기내에서 숙박하는 일수, 출장기관에서 제공하는 숙박일수를 입력하세요.",{"$nulls":16},"니제르"]
[null,"6. 기내에서 제공되는 식사, 출장기관에서 제공받는 식사횟수를 입력하세요.",{"$nulls":16},"니카라과"]
[null,"7. 하나은행 현금살때 환율을 입력하세요.",{"$nulls":16},"대만"]
[{"$nulls":18},"덴마크"]
[{"$nulls":18},"도미니카공화국"]
[{"$nulls":18},"독일"]
[{"$nulls":18},"라오스"]
[{"$nulls":18},"라이베니아"]
[{"$nulls":18},"레바논"]
[{"$nulls":18},"레소토"]
[{"$nulls":18},"루마니아"]
[{"$nulls":18},"룩셈부르크"]
[{"$nulls":18},"르완다"]
[{"$nulls":18},"리비아"]
[{"$nulls":18},"리투아니아"]
[{"$nulls":18},"마다가스트르"]
[{"$nulls":18},"마샬군도"]
[{"$nulls":18},"마이크로네시아"]
[{"$nulls":18},"말라위"]
[{"$nulls":18},"말레이시아"]
[{"$nulls":18},"말리"]
[{"$nulls":18},"멕시코"]
[{"$nulls":18},"모로코"]
[{"$nulls":18},"모리시어스"]
[{"$nulls":18},"모리타니아"]
[{"$nulls":18},"모잠비크"]
[{"$nulls":18},"몰도바"]
[{"$nulls":18},"몽골"]
[{"$nulls":18},"미얀마"]
[{"$nulls":18},"바레인"]
[{"$nulls":18},"바베이도스"]
[{"$nulls":18},"방글라데시"]
[{"$nulls":18},"베네수엘라"]
[{"$nulls":18},"베트남"]
[{"$nulls":18},"벨기에"]
[{"$nulls":18},"벨리즈"]
[{"$nulls":18},"보스니아-헤르체코비나"]
[{"$nulls":18},"보츠와나"]
[{"$nulls":18},"볼리비아"]
[{"$nulls":18},"부르키나파소"]
[{"$nulls":18},"불가리아"]
[{"$nulls":18},"브라질"]
[{"$nulls":18},"브루나이"]
[{"$nulls":18},"사우디아라비아"]
[{"$nulls":18},"상토메프린시페"]
[{"$nulls":18},"세네갈"]
[{"$nulls":18},"세이셸"]
[{"$nulls":18},"세인트루시아"]
[{"$nulls":18},"세인트빈센트"]
[{"$nulls":18},"세인트킷츠네비츠"]
[{"$nulls":18},"소말리아"]
[{"$nulls":18},"수단"]
[{"$nulls":18},"수리남"]
[{"$nulls":18},"스리랑카"]
[{"$nulls":18},"스와질랜드"]
[{"$nulls":18},"스웨덴"]
[{"$nulls":18},"스위스"]
[{"$nulls":18},"스페인"]
[{"$nulls":18},"시에라리온"]
[{"$nulls":18},"싱가포르"]
[{"$nulls":18},"아랍에미리트"]
[{"$nulls":18},"아르헨티나"]
[{"$nulls":18},"아이슬란드"]
[{"$nulls":18},"아이티"]
[{"$nulls":18},"아일랜드"]
[{"$nulls":18},"아제르바이잔"]
[{"$nulls":18},"안티구아바부다"]
[{"$nulls":18},"알바니아"]
[{"$nulls":18},"알제리"]
[{"$nulls":18},"에스토니아"]
[{"$nulls":18},"에쿠아도르"]
[{"$nulls":18},"엘살바도르"]
[{"$nulls":18},"예멘"]
[{"$nulls":18},"오만"]
[{"$nulls":18},"오스트레일리아"]
[{"$nulls":18},"오스트리아"]
[{"$nulls":18},"요르단"]
[{"$nulls":18},"우간다"]
[{"$nulls":18},"우루과이"]
[{"$nulls":18},"우즈베키스탄"]
[{"$nulls":18},"우크라이나"]
[{"$nulls":18},"유고슬라비아"]
[{"$nulls":18},"이디오피아"]
[{"$nulls":18},"이라크"]
[{"$nulls":18},"이란"]
[{"$nulls":18},"이스라엘"]
[{"$nulls":18},"이집트"]
[{"$nulls":18},"이탈리아"]
[{"$nulls":18},"인도"]
[{"$nulls":18},"인도네시아"]
[{"$nulls":18},"자메이카"]
[{"$nulls":18},"잠비아"]
[{"$nulls":18},"중앙아프리카"]
[{"$nulls":18},"짐바브웨"]
[{"$nulls":18},"체코"]
[{"$nulls":18},"칠레"]
[{"$nulls":18},"카메룬"]
[{"$nulls":18},"카자흐스탄"]
[{"$nulls":18},"카타르"]
[{"$nulls":18},"캄보디아"]
[{"$nulls":18},"캐나다"]
[{"$nulls":18},"케냐"]
[{"$nulls":18},"코스타리카"]
[{"$nulls":18},"코트디브와르"]
[{"$nulls":18},"콜롬비아"]
[{"$nulls":18},"콩고민주공화국"]
[{"$nulls":18},"쿠웨이트"]
[{"$nulls":18},"크로아티아"]
[{"$nulls":18},"키르키스탄"]
[{"$nulls":18},"탄자니아"]
[{"$nulls":18},"태국"]
[{"$nulls":18},"터키"]
[{"$nulls":18},"튀니지"]
[{"$nulls":18},"트리니다드토바고"]
[{"$nulls":18},"파나마"]
[{"$nulls":18},"파라과이"]
[{"$nulls":18},"파키스탄"]
[{"$nulls":18},"파푸아뉴기니"]
[{"$nulls":18},"페루"]
[{"$nulls":18},"포르투갈"]
[{"$nulls":18},"폴란드"]
[{"$nulls":18},"피지"]
[{"$nulls":18},"핀란드"]
[{"$nulls":18},"필리핀"]
[{"$nulls":18},"헝가리"]

{"sheet":"국내여비 산출 기준표","index":2,"n_rows":9,"n_cols":4,"rows_kept":9,"cut":false,"hidden":false,"merged":[]}
["구분","일비","숙박비","식비"]
["교수",40000,130000,40000]
["부교수",40000,130000,40000]
["명예교수",40000,130000,40000]
["석좌교수",40000,130000,40000]
["조교수",35000,115000,40000]
["비전임교원",35000,115000,40000]
["박사후연구원",25000,90000,40000]
["박사후연구원이하",25000,90000,40000]

{"sheet":"국외여비 산출 기준표","index":3,"n_rows":169,"n_cols":17,"rows_kept":169,"cut":false,"hidden":false,"merged":[]}
["국가","도시",{"$f":"A1&B1","v":"국가도시"},"등급",null,null,null,"구분","등급",{"$f":"H1&\"/\"&I1","v":"구분/등급"},"일비","숙박비","식비",null,"교수"]
["일본","동경",{"$f":"A2&\"/\"&B2","v":"일본/동경"},"특A지",null,null,null,"교수","특A지",{"$f":"H2&\"/\"&I2","v":"교수/특A지"},80,310,158,null,"부교수"]
["중국","홍콩",{"$f":"A3&\"/\"&B3","v":"중국/홍콩"},"특A지",null,null,null,"교수","특B지",{"$f":"H3&\"/\"&I3","v":"교수/특B지"},80,276,134,null,"명예교수"]
["싱가포르","싱가포르","싱가포르/싱가포르","특A지",null,null,null,"교수","갑지","교수/갑지",80,259,105,null,"석좌교수"]
["미국","뉴욕","미국/뉴욕","특A지",null,null,null,"교수","을지","교수/을지",80,197,71,null,"조교수"]
["미국","라스베이거스","미국/라스베이거스","특A지",null,null,null,"부교수","특A지","부교수/특A지",80,310,158,null,"비전임교원"]
["미국","로스앤젤레스","미국/로스앤젤레스","특A지",null,null,null,"부교수","특B지","부교수/특B지",80,276,134,null,"박사후연구원"]
["미국","보스턴","미국/보스턴","특A지",null,null,null,"부교수","갑지","부교수/갑지",80,259,105,null,"박사후연구원이하"]
["미국","샌디에이고","미국/샌디에이고","특A지",null,null,null,"부교수","을지","부교수/을지",80,197,71]
["미국","샌프란시스코","미국/샌프란시스코","특A지",null,null,null,"명예교수","특A지","명예교수/특A지",80,310,158]
["미국","워싱턴","미국/워싱턴","특A지",null,null,null,"명예교수","특B지","명예교수/특B지",80,276,134]
["미국","하와이","미국/하와이","특A지",null,null,null,"명예교수","갑지","명예교수/갑지",80,259,105]
["미국","미국","미국/미국","특B지",null,null,null,"명예교수","을지","명예교수/을지",80,197,71]
["영국","런던","영국/런던","특A지",null,null,null,"석좌교수","특A지","석좌교수/특A지",80,310,158]
["러시아","모스크바","러시아/모스크바","특A지",null,null,null,"석좌교수","특B지","석좌교수/특B지",80,276,134]
["프랑스","파리","프랑스/파리","특A지",null,null,null,"석좌교수","갑지","석좌교수/갑지",80,259,105]
["중국","마카오","중국/마카오","특B지",null,null,null,"석좌교수","을지","석좌교수/을지",80,197,71]
["중국","북경","중국/북경","특B지",null,null,null,"조교수","특A지","조교수/특A지",72,276,145]
["중국","상해","중국/상해","특B지",null,null,null,"조교수","특B지","조교수/특B지",72,241,124]
["중국","심천","중국/심천","특B지",null,null,null,"조교수","갑지","조교수/갑지",72,212,102]
["중국","광주",{"$f":"A21&\"/\"&B21","v":"중국/광주"},"갑지",null,null,null,"조교수","을지","조교수/을지",72,149,69]
["중국","남경",{"$f":"A22&\"/\"&B22","v":"중국/남경"},"갑지",null,null,null,"비전임교원","특A지","비전임교원/특A지",72,276,145]
["중국","대련",{"$f":"A23&\"/\"&B23","v":"중국/대련"},"갑지",null,null,null,"비전임교원","특B지","비전임교원/특B지",72,241,124]
["중국","천진",{"$f":"A24&\"/\"&B24","v":"중국/천진"},"갑지",null,null,null,"비전임교원","갑지","비전임교원/갑지",72,212,102]
["국가명","대만","국가명/대만","특B지",null,null,null,"비전임교원","을지","비전임교원/을지",72,149,69]
["국가명","인도","국가명/인도","특B지",null,null,null,"박사후연구원","특A지","박사후연구원/특A지",60,190,132]
["일본","일본","일본/일본","특B지",null,null,null,"박사후연구원","특B지","박사후연구원/특B지",60,165,112]
["국가명","미국","국가명/미국","특B지",null,null,null,"박사후연구원","갑지","박사후연구원/갑지",60,140,92]
["국가명","캐나다","국가명/캐나다","특B지",null,null,null,"박사후연구원","을지","박사후연구원/을지",60,108,63]
["국가명","그리스","국가명/그리스","특B지",null,null,null,"박사후연구원이하","특A지","박사후연구원이하/특A지",60,190,132]
["국가명","네덜란드","국가명/네덜란드","특B지",null,null,null,"박사후연구원이하","특B지","박사후연구원이하/특B지",60,165,112]
["국가명","노르웨이","국가명/노르웨이","특B지",null,null,null,"박사후연구원이하","갑지","박사후연구원이하/갑지",60,140,92]
["국가명","뉴질랜드","국가명/뉴질랜드","특B지",null,null,null,"박사후연구원이하","을지","박사후연구원이하/을지",60,108,63]
["국가명","덴마크","국가명/덴마크","특B지"]
["국가명","독일","국가명/독일","특B지",{"$nulls":12},"1. 국가 및 도시별 등급 구분은 다음과 같다."]
["러시아","러시아","러시아/러시아","특B지",{"$nulls":12},"가. 특A지 "]
["국가명","룩셈부르크","국가명/룩셈부르크","특B지",{"$nulls":12},"1) 아시아주, 오세아니아주: 동경, 홍콩, 싱가포르"]
["국가명","벨기에","국가명/벨기에","특B지",{"$nulls":12},"2) 아메리카주: 뉴욕, 라스베이거스, 로스앤젤레스, 보스턴, 샌디에이고, 샌프란시스코, 워싱턴, 하와이"]
["국가명","스웨덴","국가명/스웨덴","특B지",{"$nulls":12},"3) 유럽주 : 런던, 모스크바, 파리"]
["국가명","스위스","국가명/스위스","특B지",{"$nulls":12},"나. 특B지"]
["국가명","스페인","국가명/스페인","특B지",{"$nulls":12},"1) 아시아주, 오세아니아주: 마카오, 북경, 상해, 심천, 대만, 인도, 일본"]
["국가명","아이슬란드","국가명/아이슬란드","특B지",{"$nulls":12},"2) 아메리카주: 미국, 캐나다"]
["영국","영국","영국/영국","특B지",{"$nulls":12},"3) 유럽주 : 그리스, 네덜란드, 노르웨이, 뉴질랜드, 덴마크, 독일, 러시아, 룩셈부르크, 벨기에, 스웨덴, 스위스, 스페인, 아이슬란드, 영국, 오스트레일리아, 오스트리아, 이탈리아, 포르투갈, 프랑스, 핀란드, 헝가리"]
["국가명","오스트레일리아","국가명/오스트레일리아","특B지",{"$nulls":12},"4) 중동, 아프리카주: 사우디아라비아, 아랍에미리트, 아일랜드, 오만, 이스라엘, 이집트, 카타르, 쿠웨이트"]
["국가명","오스트리아","국가명/오스트리아","특B지",{"$nulls":12},"다. 갑지"]
["국가명","이탈리아","국가명/이탈리아","특B지",{"$nulls":12},"1) 아시아주, 대양주 : 광주, 남경, 대련, 천진, 베트남, 우즈베키스탄, 인도네시아, 태국"]
["국가명","포르투갈","국가명/포르투갈","특B지",{"$nulls":12},"2) 아메리카주 : 멕시코, 브라질, 세인트루시아, 세인트킷츠네비츠, 아르헨티나, 아이티, 자메이카"]
["프랑스","프랑스","프랑스/프랑스","특B지",{"$nulls":12},"3) 유럽주 : 루마니아, 우크라이나, 체코"]
["국가명","핀란드","국가명/핀란드","특B지",{"$nulls":12},"4) 중동, 아프리카주 : 가봉, 남아프리카공화국, 세이셸, 수단, 우간다, 코트디브와르, 콩고민주공화국"]
["국가명","헝가리","국가명/헝가리","특B지",{"$nulls":12},"라. 을지　"]
["국가명","사우디아라비아","국가명/사우디아라비아","특B지",{"$nulls":12},"1) 아시아주, 대양주 : 네팔, 라오스, 마샬군도, 마이크로네시아, 말레이시아, 몽골, 미얀마, 방글라데시, 브루나이, 스리랑카, 아제르바이잔, 중국, 카자흐스탄, 캄보디아, 키르키스탄, 터키, 파키스탄, 파푸아뉴기니, 피지, 필리핀"]
["국가명","아랍에미리트","국가명/아랍에미리트","특B지",{"$nulls":12},"2) 남․북아메리카주 : 가이아나, 과테말라, 니카라과, 도미니카공화국, 바베이도스, 베네수엘라, 벨리즈, 볼리비아, 세인트빈센트, 수리남, 안티구아바부다, 에쿠아도르, 엘살바도르, 우루과이, 칠레, 코스타리카, 콜롬비아, 트리니다드토바고, 파나마, 파라과이, 페루"]
["국가명","아일랜드","국가명/아일랜드","특B지",{"$nulls":12},"3) 유럽주 : 리투아니아, 몰도바, 보스니아-헤르체코비나, 불가리아, 알바니아, 에스토니아, 유고슬라비아, 크로아티아, 폴란드"]
["국가명","오만","국가명/오만","특B지",{"$nulls":12},"4) 중동, 아프리카주 : 가나, 감비아, 기네비스, 기니, 나미비아, 나이지리아, 니제르, 라이베니아, 레바논, 레소토, 르완다, 리비아, 마다가스트르, 말라위, 말리, 모로코, 모리시어스, 모리타니아, 모잠비크, 바레인, 보츠와나, 부르키나파소, 상토메프린시페, 세네갈, 소말리아, 스와질랜드, 시에라리온, 알제리, 예멘, 요르단, 이디오피아, 이라크, 이란, 잠비아, 중앙아프리카, 짐바브웨, 카메룬, 케냐, 탄자니아, 튀니지"]
["국가명","이스라엘","국가명/이스라엘","특B지"]
["국가명","이집트","국가명/이집트","특B지"]
["국가명","카타르","국가명/카타르","특B지"]
["국가명","쿠웨이트","국가명/쿠웨이트","특B지"]
["국가명","베트남","국가명/베트남","갑지"]
["국가명","우즈베키스탄","국가명/우즈베키스탄","갑지"]
["국가명","인도네시아","국가명/인도네시아","갑지"]
["국가명","태국","국가명/태국","갑지"]
["국가명","멕시코","국가명/멕시코","갑지"]
["국가명","브라질","국가명/브라질","갑지"]
["국가명","세인트루시아","국가명/세인트루시아","갑지"]
["국가명","세인트킷츠네비츠","국가명/세인트킷츠네비츠","갑지"]
["국가명","아르헨티나","국가명/아르헨티나","갑지"]
["국가명","아이티",{"$f":"A68&\"/\"&B68","v":"국가명/아이티"},"갑지"]
["국가명","자메이카","국가명/자메이카","갑지"]
["국가명","루마니아","국가명/루마니아","갑지"]
["국가명","우크라이나","국가명/우크라이나","갑지"]
["국가명","체코","국가명/체코","갑지"]
["국가명","가봉","국가명/가봉","갑지"]
["국가명","남아프리카공화국","국가명/남아프리카공화국","갑지"]
["국가명","세이셸","국가명/세이셸","갑지"]
["국가명","수단","국가명/수단","갑지"]
["국가명","우간다","국가명/우간다","갑지"]
["국가명","코트디브와르","국가명/코트디브와르","갑지"]
["국가명","콩고민주공화국","국가명/콩고민주공화국","갑지"]
["국가명","네팔","국가명/네팔","을지"]
["국가명","라오스","국가명/라오스","을지"]
["국가명","마샬군도","국가명/마샬군도","을지"]
["국가명","마이크로네시아","국가명/마이크로네시아","을지"]
["국가명","말레이시아","국가명/말레이시아","을지"]
["국가명","몽골","국가명/몽골","을지"]
["국가명","미얀마","국가명/미얀마","을지"]
["국가명","방글라데시","국가명/방글라데시","을지"]
["국가명","브루나이","국가명/브루나이","을지"]
["국가명","스리랑카","국가명/스리랑카","을지"]
["국가명","아제르바이잔","국가명/아제르바이잔","을지"]
["중국","중국","중국/중국","을지"]
["국가명","카자흐스탄","국가명/카자흐스탄","을지"]
["국가명","캄보디아","국가명/캄보디아","을지"]
["국가명","키르키스탄","국가명/키르키스탄","을지"]
["국가명","터키","국가명/터키","을지"]
["국가명","파키스탄","국가명/파키스탄","을지"]
["국가명","파푸아뉴기니","국가명/파푸아뉴기니","을지"]
["국가명","피지","국가명/피지","을지"]
["국가명","필리핀","국가명/필리핀","을지"]
["국가명","가이아나","국가명/가이아나","을지"]
["국가명","과테말라","국가명/과테말라","을지"]
["국가명","니카라과","국가명/니카라과","을지"]
["국가명","도미니카공화국","국가명/도미니카공화국","을지"]
["국가명","바베이도스","국가명/바베이도스","을지"]
["국가명","베네수엘라","국가명/베네수엘라","을지"]
["국가명","벨리즈","국가명/벨리즈","을지"]
["국가명","볼리비아","국가명/볼리비아","을지"]
["국가명","세인트빈센트","국가명/세인트빈센트","을지"]
["국가명","수리남","국가명/수리남","을지"]
["국가명","안티구아바부다","국가명/안티구아바부다","을지"]
["국가명","에쿠아도르","국가명/에쿠아도르","을지"]
["국가명","엘살바도르","국가명/엘살바도르","을지"]
["국가명","우루과이","국가명/우루과이","을지"]
["국가명","칠레","국가명/칠레","을지"]
["국가명","코스타리카","국가명/코스타리카","을지"]
["국가명","콜롬비아","국가명/콜롬비아","을지"]
["국가명","트리니다드토바고","국가명/트리니다드토바고","을지"]
["국가명","파나마","국가명/파나마","을지"]
["국가명","파라과이","국가명/파라과이","을지"]
["국가명","페루","국가명/페루","을지"]
["국가명","리투아니아","국가명/리투아니아","을지"]
["국가명","몰도바","국가명/몰도바","을지"]
["국가명","보스니아-헤르체코비나","국가명/보스니아-헤르체코비나","을지"]
["국가명","불가리아","국가명/불가리아","을지"]
["국가명","알바니아","국가명/알바니아","을지"]
["국가명","에스토니아","국가명/에스토니아","을지"]
["국가명","유고슬라비아","국가명/유고슬라비아","을지"]
["국가명","크로아티아","국가명/크로아티아","을지"]
["국가명","폴란드","국가명/폴란드","을지"]
["국가명","가나","국가명/가나","을지"]
["국가명","감비아","국가명/감비아","을지"]
["국가명","기네비스",{"$f":"A132&\"/\"&B132","v":"국가명/기네비스"},"을지"]
["국가명","기니","국가명/기니","을지"]
["국가명","나미비아","국가명/나미비아","을지"]
["국가명","나이지리아","국가명/나이지리아","을지"]
["국가명","니제르","국가명/니제르","을지"]
["국가명","라이베니아","국가명/라이베니아","을지"]
["국가명","레바논","국가명/레바논","을지"]
["국가명","레소토","국가명/레소토","을지"]
["국가명","르완다","국가명/르완다","을지"]
["국가명","리비아","국가명/리비아","을지"]
["국가명","마다가스트르","국가명/마다가스트르","을지"]
["국가명","말라위","국가명/말라위","을지"]
["국가명","말리","국가명/말리","을지"]
["국가명","모로코","국가명/모로코","을지"]
["국가명"," 모리시어스","국가명/ 모리시어스","을지"]
["국가명","모리타니아","국가명/모리타니아","을지"]
["국가명","모잠비크","국가명/모잠비크","을지"]
["국가명","바레인","국가명/바레인","을지"]
["국가명","보츠와나","국가명/보츠와나","을지"]
["국가명","부르키나파소","국가명/부르키나파소","을지"]
["국가명","상토메프린시페","국가명/상토메프린시페","을지"]
["국가명","세네갈","국가명/세네갈","을지"]
["국가명","소말리아","국가명/소말리아","을지"]
["국가명","스와질랜드","국가명/스와질랜드","을지"]
["국가명","시에라리온","국가명/시에라리온","을지"]
["국가명","알제리","국가명/알제리","을지"]
["국가명","예멘","국가명/예멘","을지"]
["국가명","요르단","국가명/요르단","을지"]
["국가명","이디오피아","국가명/이디오피아","을지"]
["국가명","이라크","국가명/이라크","을지"]
["국가명","이란","국가명/이란","을지"]
["국가명","잠비아","국가명/잠비아","을지"]
["국가명","중앙아프리카","국가명/중앙아프리카","을지"]
["국가명","짐바브웨","국가명/짐바브웨","을지"]
["국가명","카메룬","국가명/카메룬","을지"]
["국가명","케냐","국가명/케냐","을지"]
["국가명","탄자니아","국가명/탄자니아","을지"]
["국가명","튀니지","국가명/튀니지","을지"]