{"text_format":"2","workbook":"xlsx","n_sheets":4,"sheets":["급여계산기(산단장발령)","급여계산기(총장발령)","2024년 간이세액표","2026 최저시급"],"not_rendered":{"charts":0,"images":0,"macros":0,"external_links":4,"defined_names":26,"comments":1,"pivot_tables":0},"unopened":[],"bounds":{"document_bytes":16777216,"sheet_cells":100000,"run_cost":"one","rows_first":2000,"rows_last":500,"rows_between":2000,"halvings":0,"cell_chars":16384,"cell_head_chars":4096},"cells_cut":0,"cells_raw":0,"read":"whole","date_system":"1900"}

{"sheet":"급여계산기(산단장발령)","index":0,"n_rows":29,"n_cols":13,"rows_kept":29,"cut":false,"hidden":false,"merged":[[27,3,27,4],[13,3,13,4]]}
["■ 월 급여 계산기(과제확보 예산을 알지만 월 급여액을 얼마로 해야할지 모를때)"]
["과제에서 확보된 재원",40000000,"인건비 세목예산",null,"<급여명세서(예상)>",null,null,null,"4대보험 요율","개인부담금","법인부담금","합계"]
["참여개월수",12,null,null,"급여항목","금액",null,null,"국민",4.7500000000000001E-2,4.7500000000000001E-2,{"$f":"J3+K3","v":9.5000000000000001E-2},"2026인상"]
["월급여",{"$f":"IF(B6=\"O\",ROUNDDOWN((12*B2)/(12*B3*법인요율+13*B3),-3),ROUNDDOWN(B2/(B3*법인요율+B3),-3))","v":2997000},"계약서 기재 금액(식대포함)",null,"월급여",{"$f":"B4","v":2997000},null,null,"건강",4.0673830000000001E-2,4.0673830000000001E-2,{"$f":"J4+K4","v":8.1347660000000002E-2},"2026인상"]
["(식대)",200000,null,null,"세액",{"$f":"IFERROR(F6+F7,0)","v":61540},null,null,"고용",8.9999999999999993E-3,1.55E-2,2.4500000000000001E-2]
["퇴직금 유무","X",null,null,"    소득세",{"$f":"IFERROR(VLOOKUP((F4-F9)/1000,'2024년 간이세액표'!A1:M659,3,1),0)","v":55950},null,null,"산재",0,6.3600000000000002E-3,6.3600000000000002E-3,"2026인상"]
["일 최대 근로시간(H)",8,"2026 최저시급 기준적용(일3시간이상(주15시간이상)만가능)",null,"    지방소득세",{"$f":"IFERROR(ROUNDDOWN(F6*10%,-1),0)","v":5590},null,null,"예비율",null,2E-3,2E-3]
["총 급여",{"$f":"B4*B3","v":35964000},"월급여 × 참여개월수",null,"4대보험개인부담금",{"$f":"F4:F4*개인요율","v":291229.96851000004},null,null,"계",{"$f":"SUM(J3:J7)","v":9.7173830000000003E-2},{"$f":"SUM(K3:K7)","v":0.11203383000000001},0.20920766000000002]
["월 퇴직금",{"$f":"IF(B6=\"O\",B4/12,0)","v":0},"월급여 ÷ 12",null,"식대",{"$f":"B5","v":200000},null,null,"* 건강3.595%+요양(건강*13.14%)"]
["총 퇴직금",{"$f":"B9*B3","v":0},"월 퇴직금 × 참여개월수",null,"실수령액",{"$f":"F4-F5-F8","v":2644230.03149}]
["월 법인부담금",{"$f":"(B4-B5)*법인요율","v":313358.62251000002},"월급여 × 법인부담금 요율"]
["총 법인부담금",{"$f":"B11*B3","v":3760303.4701200002},"월 법인부담금 × 12"]
["총 소요비용 계",{"$f":"B8+B10+B12","v":39724303.470119998},"연급여+퇴직금+연법인부담금"]
["예상잔액",{"$f":"B2-B13","v":275696.52988000214},null,{"$f":"IF(B4<VLOOKUP(B7,'2026 최저시급'!G5:L10,6,FALSE),\"최저임금 미달입니다.(급여조정필요)\",\"\")","v":""}]
["※ 노란색 셀값만 변경"]
[]
["■ 월 급여 계산기(월 급여액을 알지만 전체 소요 예상비용을 모를때)"]
["월 급여",1360000,"계약서 기재 금액(식대포함)",null,"<급여명세서(예상)>"]
["참여개월수",12,null,null,"급여항목","금액"]
["(식대)",200000,null,null,"월급여",{"$f":"B18","v":1360000}]
["퇴직금 유무","O",null,null,"세액",{"$f":"F22+F23","v":2680}]
["일 최대 근로시간(H)",5,"2026 최저시급 기준적용(일3시간이상(주15시간이상)만가능)",null,"    소득세",{"$f":"IFERROR(VLOOKUP((F20-F25)/1000,'2024년 간이세액표'!A:M,3,1),0)","v":2440}]
["총 급여",{"$f":"B18*B19","v":16320000},"월급여 × 참여개월수",null,"    지방소득세",{"$f":"IFERROR(ROUNDDOWN(F22*10%,-1),0)","v":240}]
["월 퇴직금",{"$f":"IF(B21=\"O\",B18/12,0)","v":113333.33333333333},"월급여 ÷ 12",null,"4대보험개인부담금",{"$f":"F20*개인요율","v":132156.4088}]
["총 퇴직금",{"$f":"B24*B19","v":1360000},"월 퇴직금 × 참여개월수",null,"식대",{"$f":"B20","v":200000}]
["월 법인부담금",{"$f":"(B18-B20)*법인요율","v":129959.24280000002},"월급여 × 법인부담금 요율",null,"실수령액",{"$f":"F20-F21-F24","v":1225163.5911999999}]
["총 법인부담금",{"$f":"B26*B19","v":1559510.9136000003},"월 법인부담금 × 12"]
["총 소요비용 계",{"$f":"B23+B25+B27","v":19239510.913600001},"연급여+퇴직금+연법인부담금",{"$f":"IF(B18<VLOOKUP(B22,'2026 최저시급'!G5:L10,6,FALSE),\"최저임금 미달입니다.(급여조정필요)\",\"\")","v":""}]
["※ 노란색 셀값만 변경"]

{"sheet":"급여계산기(총장발령)","index":1,"n_rows":28,"n_cols":13,"rows_kept":28,"cut":false,"hidden":false,"merged":[]}
["■ 월 급여 계산기(과제확보 예산을 알지만 월 급여액을 얼마로 해야할지 모를때)"]
["과제에서 확보된 재원",30000000,"인건비 세목예산",null,"<급여명세서(예상)>",null,null,null,"4대보험 요율","개인부담금","법인부담금","합계"]
["참여개월수",12,null,null,"급여항목","금액",null,null,"고용",8.9999999999999993E-3,1.7500000000000002E-2,{"$f":"SUM(J3:K3)","v":2.6500000000000003E-2}]
["월급여",{"$f":"IF(B6=\"O\",ROUNDDOWN((12*B2)/(12*B3*법인요율+13*B3),-3),ROUNDDOWN(B2/(B3*법인요율+B3),-3))","v":2085000},"계약서 기재 금액(식대포함)",null,"월급여",{"$f":"B4","v":2085000},null,null,"산재",0,7.6400000000000001E-3,7.6400000000000001E-3]
["(식대)","X","연구교원식대없음",null,"세액",{"$f":"F6+F7","v":24290},null,null,"국민",4.7500000000000001E-2,4.7500000000000001E-2,9.5000000000000001E-2,"2026인상"]
["퇴직금 유무","O",null,null,"    소득세",{"$f":"IFERROR(VLOOKUP(F4/1000,'2024년 간이세액표'!A1:M659,3,1),0)","v":22090},null,null,"건강",4.0673830000000001E-2,4.0673830000000001E-2,8.1347660000000002E-2,"2026인상"]
["일 최대 근로시간(H)",8,"2026 최저시급 기준적용",null,"    지방소득세",{"$f":"IFERROR(ROUNDDOWN(F6*10%,-1),0)","v":2200},null,null,"예비율",null,1.8600000000000001E-3,1.8600000000000001E-3]
["총 급여",{"$f":"B4*B3","v":25020000},"월급여 × 참여개월수",null,"4대보험개인부담금",{"$f":"F4*개인요율","v":202607.43554999999},null,null,"계",{"$f":"SUM(J3:J7)","v":9.7173830000000003E-2},{"$f":"SUM(K3:K7)","v":0.11517383},0.21234765999999999]
["월 퇴직금",{"$f":"IF(B6=\"O\",B4/12,0)","v":173750},"월급여 ÷ 12",null,"식대",null,null,null,"* 건강3.595%+요양(건강*13.14%)"]
["총 퇴직금",{"$f":"B9*B3","v":2085000},"월 퇴직금 × 참여개월수",null,"실수령액",{"$f":"F4-F5-F8+F9","v":1858102.5644499999}]
["월 법인부담금",{"$f":"B4*법인요율","v":240137.43555000002},"월급여 × 법인부담금 요율"]
["총 법인부담금",{"$f":"B11*B3","v":2881649.2266000002},"월 법인부담금 × 12"]
["총 소요비용 계",{"$f":"B8+B10+B12","v":29986649.226599999},"연급여+퇴직금+연법인부담금"]
["예상잔액",{"$f":"B2-B13","v":13350.773400001228}]
["※ 노란색 셀값만 변경"]
[]
["■ 월 급여 계산기(월 급여액을 알지만 전체 소요 예상비용을 모를때)"]
["월 급여",3000000,"계약서 기재 금액(식대포함)",null,"<급여명세서(예상)>"]
["참여개월수",12,null,null,"급여항목","금액"]
["(식대)","X","연구교원식대없음",null,"월급여",{"$f":"B18","v":3000000}]
["퇴직금 유무","O",null,null,"세액",{"$f":"F22+F23","v":81780}]
["총 급여",{"$f":"B18*B19","v":36000000},"월급여 × 참여개월수",null,"    소득세",{"$f":"IFERROR(VLOOKUP(F20/1000,'2024년 간이세액표'!A17:M675,3,1),0)","v":74350}]
["월 퇴직금",{"$f":"IF(B21=\"O\",B18/12,0)","v":250000},"월급여 ÷ 12",null,"    지방소득세",{"$f":"IFERROR(ROUNDDOWN(F22*10%,-1),0)","v":7430}]
["총 퇴직금",{"$f":"B23*B19","v":3000000},"월 퇴직금 × 참여개월수",null,"4대보험개인부담금",{"$f":"F20*개인요율","v":291521.49}]
["월 법인부담금",{"$f":"B18*법인요율","v":345521.49},"월급여 × 법인부담금 요율",null,"식대"]
["총 법인부담금",{"$f":"B25*B19","v":4146257.88},"월 법인부담금 × 12",null,"실수령액",{"$f":"F20-F21-F24+F25","v":2626698.5099999998}]
["총 소요비용 계",{"$f":"B22+B24+B26","v":43146257.880000003},"연급여+퇴직금+연법인부담금"]
["※ 노란색 셀값만 변경"]

{"sheet":"2024년 간이세액표","index":2,"n_rows":664,"n_cols":13,"rows_kept":664,"cut":false,"hidden":false,"merged":[[0,0,0,12],[652,0,652,1],[652,2,652,12],[653,0,654,1],[653,2,654,12],[651,0,651,1],[661,0,662,1],[661,2,662,12],[655,0,656,1],[655,2,656,12],[657,0,658,1],[657,2,658,12],[659,0,660,1],[659,2,660,12]]}
["2024년 근로소득에 대한 간이세액표(제189조 관련)"]
[{"$nulls":12},"(단위 : 원)"]
[]
[null,null,1,2,3,4,5,6,7,8,9,10,11]
[]
[770,775,0,0,0,0,0,0,0,0,0,0,0]
[775,780,0,0,0,0,0,0,0,0,0,0,0]
[780,785,0,0,0,0,0,0,0,0,0,0,0]
[785,790,0,0,0,0,0,0,0,0,0,0,0]
[790,795,0,0,0,0,0,0,0,0,0,0,0]
[795,800,0,0,0,0,0,0,0,0,0,0,0]
[800,805,0,0,0,0,0,0,0,0,0,0,0]
[805,810,0,0,0,0,0,0,0,0,0,0,0]
[810,815,0,0,0,0,0,0,0,0,0,0,0]
[815,820,0,0,0,0,0,0,0,0,0,0,0]
[820,825,0,0,0,0,0,0,0,0,0,0,0]
[825,830,0,0,0,0,0,0,0,0,0,0,0]
[830,835,0,0,0,0,0,0,0,0,0,0,0]
[835,840,0,0,0,0,0,0,0,0,0,0,0]
[840,845,0,0,0,0,0,0,0,0,0,0,0]
[845,850,0,0,0,0,0,0,0,0,0,0,0]
[850,855,0,0,0,0,0,0,0,0,0,0,0]
[855,860,0,0,0,0,0,0,0,0,0,0,0]
[860,865,0,0,0,0,0,0,0,0,0,0,0]
[865,870,0,0,0,0,0,0,0,0,0,0,0]
[870,875,0,0,0,0,0,0,0,0,0,0,0]
[875,880,0,0,0,0,0,0,0,0,0,0,0]
[880,885,0,0,0,0,0,0,0,0,0,0,0]
[885,890,0,0,0,0,0,0,0,0,0,0,0]
[890,895,0,0,0,0,0,0,0,0,0,0,0]
[895,900,0,0,0,0,0,0,0,0,0,0,0]
[900,905,0,0,0,0,0,0,0,0,0,0,0]
[905,910,0,0,0,0,0,0,0,0,0,0,0]
[910,915,0,0,0,0,0,0,0,0,0,0,0]
[915,920,0,0,0,0,0,0,0,0,0,0,0]
[920,925,0,0,0,0,0,0,0,0,0,0,0]
[925,930,0,0,0,0,0,0,0,0,0,0,0]
[930,935,0,0,0,0,0,0,0,0,0,0,0]
[935,940,0,0,0,0,0,0,0,0,0,0,0]
[940,945,0,0,0,0,0,0,0,0,0,0,0]
[945,950,0,0,0,0,0,0,0,0,0,0,0]
[950,955,0,0,0,0,0,0,0,0,0,0,0]
[955,960,0,0,0,0,0,0,0,0,0,0,0]
[960,965,0,0,0,0,0,0,0,0,0,0,0]
[965,970,0,0,0,0,0,0,0,0,0,0,0]
[970,975,0,0,0,0,0,0,0,0,0,0,0]
[975,980,0,0,0,0,0,0,0,0,0,0,0]
[980,985,0,0,0,0,0,0,0,0,0,0,0]
[985,990,0,0,0,0,0,0,0,0,0,0,0]
[990,995,0,0,0,0,0,0,0,0,0,0,0]
[995,1000,0,0,0,0,0,0,0,0,0,0,0]
[1000,1005,0,0,0,0,0,0,0,0,0,0,0]
[1005,1010,0,0,0,0,0,0,0,0,0,0,0]
[1010,1015,0,0,0,0,0,0,0,0,0,0,0]
[1015,1020,0,0,0,0,0,0,0,0,0,0,0]
[1020,1025,0,0,0,0,0,0,0,0,0,0,0]
[1025,1030,0,0,0,0,0,0,0,0,0,0,0]
[1030,1035,0,0,0,0,0,0,0,0,0,0,0]
[1035,1040,0,0,0,0,0,0,0,0,0,0,0]
[1040,1045,0,0,0,0,0,0,0,0,0,0,0]
[1045,1050,0,0,0,0,0,0,0,0,0,0,0]
[1050,1055,0,0,0,0,0,0,0,0,0,0,0]
[1055,1060,0,0,0,0,0,0,0,0,0,0,0]
[1060,1065,1040,0,0,0,0,0,0,0,0,0,0]
[1065,1070,1110,0,0,0,0,0,0,0,0,0,0]
[1070,1075,1180,0,0,0,0,0,0,0,0,0,0]
[1075,1080,1250,0,0,0,0,0,0,0,0,0,0]
[1080,1085,1320,0,0,0,0,0,0,0,0,0,0]
[1085,1090,1390,0,0,0,0,0,0,0,0,0,0]
[1090,1095,1460,0,0,0,0,0,0,0,0,0,0]
[1095,1100,1530,0,0,0,0,0,0,0,0,0,0]
[1100,1105,1600,0,0,0,0,0,0,0,0,0,0]
[1105,1110,1670,0,0,0,0,0,0,0,0,0,0]
[1110,1115,1740,0,0,0,0,0,0,0,0,0,0]
[1115,1120,1810,0,0,0,0,0,0,0,0,0,0]
[1120,1125,1880,0,0,0,0,0,0,0,0,0,0]
[1125,1130,1950,0,0,0,0,0,0,0,0,0,0]
[1130,1135,2020,0,0,0,0,0,0,0,0,0,0]
[1135,1140,2090,0,0,0,0,0,0,0,0,0,0]
[1140,1145,2160,0,0,0,0,0,0,0,0,0,0]
[1145,1150,2230,0,0,0,0,0,0,0,0,0,0]
[1150,1155,2300,0,0,0,0,0,0,0,0,0,0]
[1155,1160,2370,0,0,0,0,0,0,0,0,0,0]
[1160,1165,2440,0,0,0,0,0,0,0,0,0,0]
[1165,1170,2500,0,0,0,0,0,0,0,0,0,0]
[1170,1175,2570,0,0,0,0,0,0,0,0,0,0]
[1175,1180,2640,0,0,0,0,0,0,0,0,0,0]
[1180,1185,2710,0,0,0,0,0,0,0,0,0,0]
[1185,1190,2780,0,0,0,0,0,0,0,0,0,0]
[1190,1195,2850,0,0,0,0,0,0,0,0,0,0]
[1195,1200,2920,0,0,0,0,0,0,0,0,0,0]
[1200,1205,2990,0,0,0,0,0,0,0,0,0,0]
[1205,1210,3060,0,0,0,0,0,0,0,0,0,0]
[1210,1215,3130,0,0,0,0,0,0,0,0,0,0]
[1215,1220,3200,0,0,0,0,0,0,0,0,0,0]
[1220,1225,3270,0,0,0,0,0,0,0,0,0,0]
[1225,1230,3340,0,0,0,0,0,0,0,0,0,0]
[1230,1235,3410,0,0,0,0,0,0,0,0,0,0]
[1235,1240,3480,0,0,0,0,0,0,0,0,0,0]
[1240,1245,3550,0,0,0,0,0,0,0,0,0,0]
[1245,1250,3620,0,0,0,0,0,0,0,0,0,0]
[1250,1255,3700,0,0,0,0,0,0,0,0,0,0]
[1255,1260,3810,0,0,0,0,0,0,0,0,0,0]
[1260,1265,3910,0,0,0,0,0,0,0,0,0,0]
[1265,1270,4010,0,0,0,0,0,0,0,0,0,0]
[1270,1275,4120,0,0,0,0,0,0,0,0,0,0]
[1275,1280,4220,0,0,0,0,0,0,0,0,0,0]
[1280,1285,4320,0,0,0,0,0,0,0,0,0,0]
[1285,1290,4430,0,0,0,0,0,0,0,0,0,0]
[1290,1295,4530,0,0,0,0,0,0,0,0,0,0]
[1295,1300,4630,0,0,0,0,0,0,0,0,0,0]
[1300,1305,4740,0,0,0,0,0,0,0,0,0,0]
[1305,1310,4840,0,0,0,0,0,0,0,0,0,0]
[1310,1315,4940,0,0,0,0,0,0,0,0,0,0]
[1315,1320,5050,0,0,0,0,0,0,0,0,0,0]
[1320,1325,5150,0,0,0,0,0,0,0,0,0,0]
[1325,1330,5250,0,0,0,0,0,0,0,0,0,0]
[1330,1335,5360,0,0,0,0,0,0,0,0,0,0]
[1335,1340,5460,0,0,0,0,0,0,0,0,0,0]
[1340,1345,5560,1060,0,0,0,0,0,0,0,0,0]
[1345,1350,5670,1170,0,0,0,0,0,0,0,0,0]
[1350,1355,5770,1270,0,0,0,0,0,0,0,0,0]
[1355,1360,5870,1370,0,0,0,0,0,0,0,0,0]
[1360,1365,5980,1480,0,0,0,0,0,0,0,0,0]
[1365,1370,6080,1580,0,0,0,0,0,0,0,0,0]
[1370,1375,6180,1680,0,0,0,0,0,0,0,0,0]
[1375,1380,6290,1790,0,0,0,0,0,0,0,0,0]
[1380,1385,6390,1890,0,0,0,0,0,0,0,0,0]
[1385,1390,6490,1990,0,0,0,0,0,0,0,0,0]
[1390,1395,6600,2100,0,0,0,0,0,0,0,0,0]
[1395,1400,6700,2200,0,0,0,0,0,0,0,0,0]
[1400,1405,6800,2300,0,0,0,0,0,0,0,0,0]
[1405,1410,6910,2410,0,0,0,0,0,0,0,0,0]
[1410,1415,7010,2510,0,0,0,0,0,0,0,0,0]
[1415,1420,7110,2610,0,0,0,0,0,0,0,0,0]
[1420,1425,7210,2710,0,0,0,0,0,0,0,0,0]
[1425,1430,7320,2820,0,0,0,0,0,0,0,0,0]
[1430,1435,7420,2920,0,0,0,0,0,0,0,0,0]
[1435,1440,7520,3020,0,0,0,0,0,0,0,0,0]
[1440,1445,7630,3130,0,0,0,0,0,0,0,0,0]
[1445,1450,7730,3230,0,0,0,0,0,0,0,0,0]
[1450,1455,7830,3330,0,0,0,0,0,0,0,0,0]
[1455,1460,7940,3440,0,0,0,0,0,0,0,0,0]
[1460,1465,8040,3540,0,0,0,0,0,0,0,0,0]
[1465,1470,8140,3640,0,0,0,0,0,0,0,0,0]
[1470,1475,8250,3750,0,0,0,0,0,0,0,0,0]
[1475,1480,8350,3850,0,0,0,0,0,0,0,0,0]
[1480,1485,8450,3950,0,0,0,0,0,0,0,0,0]
[1485,1490,8560,4060,0,0,0,0,0,0,0,0,0]
[1490,1495,8660,4160,0,0,0,0,0,0,0,0,0]
[1495,1500,8760,4260,0,0,0,0,0,0,0,0,0]
[1500,1510,8920,4420,0,0,0,0,0,0,0,0,0]
[1510,1520,9120,4620,0,0,0,0,0,0,0,0,0]
[1520,1530,9330,4830,0,0,0,0,0,0,0,0,0]
[1530,1540,9540,5040,0,0,0,0,0,0,0,0,0]
[1540,1550,9740,5240,0,0,0,0,0,0,0,0,0]
[1550,1560,9950,5450,0,0,0,0,0,0,0,0,0]
[1560,1570,10160,5660,0,0,0,0,0,0,0,0,0]
[1570,1580,10360,5860,0,0,0,0,0,0,0,0,0]
[1580,1590,10570,6070,0,0,0,0,0,0,0,0,0]
[1590,1600,10780,6280,0,0,0,0,0,0,0,0,0]
[1600,1610,10980,6480,0,0,0,0,0,0,0,0,0]
[1610,1620,11190,6690,0,0,0,0,0,0,0,0,0]
[1620,1630,11400,6900,0,0,0,0,0,0,0,0,0]
[1630,1640,11600,7100,0,0,0,0,0,0,0,0,0]
[1640,1650,11810,7310,0,0,0,0,0,0,0,0,0]
[1650,1660,12020,7520,0,0,0,0,0,0,0,0,0]
[1660,1670,12220,7720,0,0,0,0,0,0,0,0,0]
[1670,1680,12430,7930,0,0,0,0,0,0,0,0,0]
[1680,1690,12640,8140,0,0,0,0,0,0,0,0,0]
[1690,1700,12840,8340,0,0,0,0,0,0,0,0,0]
[1700,1710,13050,8550,0,0,0,0,0,0,0,0,0]
[1710,1720,13260,8760,0,0,0,0,0,0,0,0,0]
[1720,1730,13460,8960,1040,0,0,0,0,0,0,0,0]
[1730,1740,13670,9170,1240,0,0,0,0,0,0,0,0]
[1740,1750,13880,9380,1440,0,0,0,0,0,0,0,0]
[1750,1760,14080,9580,1640,0,0,0,0,0,0,0,0]
[1760,1770,14290,9790,1830,0,0,0,0,0,0,0,0]
[1770,1780,14500,10000,2030,0,0,0,0,0,0,0,0]
[1780,1790,14700,10200,2230,0,0,0,0,0,0,0,0]
[1790,1800,14910,10410,2430,0,0,0,0,0,0,0,0]
[1800,1810,15110,10610,2630,0,0,0,0,0,0,0,0]
[1810,1820,15320,10820,2830,0,0,0,0,0,0,0,0]
[1820,1830,15530,11030,3020,0,0,0,0,0,0,0,0]
[1830,1840,15730,11230,3220,0,0,0,0,0,0,0,0]
[1840,1850,15940,11440,3420,0,0,0,0,0,0,0,0]
[1850,1860,16150,11650,3620,0,0,0,0,0,0,0,0]
[1860,1870,16350,11850,3820,0,0,0,0,0,0,0,0]
[1870,1880,16560,12060,4020,0,0,0,0,0,0,0,0]
[1880,1890,16770,12270,4220,0,0,0,0,0,0,0,0]
[1890,1900,16970,12470,4410,1040,0,0,0,0,0,0,0]
[1900,1910,17180,12680,4610,1240,0,0,0,0,0,0,0]
[1910,1920,17390,12890,4810,1440,0,0,0,0,0,0,0]
[1920,1930,17590,13090,5010,1630,0,0,0,0,0,0,0]
[1930,1940,17800,13300,5210,1830,0,0,0,0,0,0,0]
[1940,1950,18010,13510,5410,2030,0,0,0,0,0,0,0]
[1950,1960,18210,13710,5600,2230,0,0,0,0,0,0,0]
[1960,1970,18420,13920,5800,2430,0,0,0,0,0,0,0]
[1970,1980,18630,14130,6000,2630,0,0,0,0,0,0,0]
[1980,1990,18880,14330,6200,2820,0,0,0,0,0,0,0]
{"$rows_left_out":465}
{"sheet":"2026 최저시급","index":3,"n_rows":10,"n_cols":13,"rows_kept":10,"cut":false,"hidden":false,"merged":[[0,0,0,2],[0,4,0,5]]}
["최저시급(원)",null,null,10320,"2026년 기준"]
[]
["■ 2026"]
["월","화","수","목","금","월-금 시간","주휴시간","근로시간/주","주/년","근로시간/년","근로시간/달","월최저계약액(원) 2026"]
[8,8,8,8,8,40,8,48,52.142857142857146,2502.8571428571431,209,2156880]
[7,7,7,7,7,35,7,42,52.142857142857146,2190,183,1888560]
[6,6,6,6,6,30,6,36,52.142857142857146,1877.1428571428573,157,1620240]
[5,5,5,5,5,25,5,30,52.142857142857146,1564.2857142857144,131,1351920]
[4,4,4,4,4,20,4,24,52.142857142857146,1251.4285714285716,105,1083600]
[3,3,3,3,3,15,3,18,52.142857142857146,938.57142857142867,79,815280,"주 15시간 이상 근무 시에만 근로계약 체결 가능"]